Target
C-C chemokine receptor type 5
Ligand
BDBM50205734
Substrate
Meas. Tech.
ChEMBL_428417 (CHEMBL919487)
IC50
5800±n/a nM
Citation
 Kellenberger, ESpringael, JYParmentier, MHachet-Haas, MGalzi, JLRognan, D Identification of nonpeptide CCR5 receptor agonists by structure-based virtual screening. J Med Chem 50:1294-303 (2007)  
Target
Name:
C-C chemokine receptor type 5
Synonyms:
C-C CKR-5 CC-CKR-5 CCR5 CCR5_HUMAN CHEMR13 HIV-1 fusion coreceptor
Type:
Enzyme
Mol. Mass.:
40540.21
Organism:
Homo sapiens (Human)
Description:
P51681
Residue:
352
  
Inhibitor
Name:
BDBM50205734
Synonyms:
1-(6-thiophen-2-yl-pyridazin-3-yl)-piperidine-4-carboxylic acid [1-(4-methyl-benzyl)-pyrrolidin-3-ylmethyl]-amide | CHEMBL220199
Type:
Small organic molecule
Emp. Form.:
C27H33N5OS
Mol. Mass.:
475.649
SMILES:
Cc1ccc(CN2CCC(CNC(=O)C3CCN(CC3)c3ccc(nn3)-c3cccs3)C2)cc1
: