Target
C-C chemokine receptor type 5
Ligand
BDBM50205737
Substrate
Meas. Tech.
ChEMBL_428417 (CHEMBL919487)
IC50
79400±n/a nM
Citation
 Kellenberger, ESpringael, JYParmentier, MHachet-Haas, MGalzi, JLRognan, D Identification of nonpeptide CCR5 receptor agonists by structure-based virtual screening. J Med Chem 50:1294-303 (2007)  
Target
Name:
C-C chemokine receptor type 5
Synonyms:
C-C CKR-5 CC-CKR-5 CCR5 CCR5_HUMAN CHEMR13 HIV-1 fusion coreceptor
Type:
Enzyme
Mol. Mass.:
40540.21
Organism:
Homo sapiens (Human)
Description:
P51681
Residue:
352
  
Inhibitor
Name:
BDBM50205737
Synonyms:
1-((1-(4-fluorobenzyl)-1H-tetrazol-5-yl)(2-fluorophenyl)methyl)-4-cyclohexylpiperazine | CHEMBL375591
Type:
Small organic molecule
Emp. Form.:
C25H30F2N6
Mol. Mass.:
452.5427
SMILES:
Fc1ccc(Cn2nnnc2C(N2CCN(CC2)C2CCCCC2)c2ccccc2F)cc1
: