Target
5-hydroxytryptamine receptor 7
Ligand
BDBM50210122
Substrate
Meas. Tech.
ChEMBL_443951 (CHEMBL893116)
Ki
6.2±n/a nM
Citation
 Paillet-Loilier, MFabis, FLepailleur, ABureau, RButt-Gueulle, SDauphin, FLesnard, ADelarue, CVaudry, HRault, S Novel aminoethylbiphenyls as 5-HT7 receptor ligands. Bioorg Med Chem Lett 17:3018-22 (2007)  
Target
Name:
5-hydroxytryptamine receptor 7
Synonyms:
5-HT-7 5-HT7 5-HT7S 5HT7 HTR7 | Serotonin receptor 7
Type:
G Protein-Coupled Receptor (GPCR)
Mol. Mass.:
53573.08
Organism:
Homo sapiens (Human)
Description:
P34969
Residue:
479
  
Inhibitor
Name:
BDBM50210122
Synonyms:
CHEMBL234881 | [2-(2',6'-dimethyl-biphenyl-3-yl)-ethyl]-dimethyl-amine
Type:
Small organic molecule
Emp. Form.:
C18H23N
Mol. Mass.:
253.3819
SMILES:
CN(C)CCc1cccc(c1)-c1c(C)cccc1C
: