Target
ATP-binding cassette sub-family C member 8/ATP-sensitive inward rectifier potassium channel 11
Ligand
BDBM86248
Substrate
Meas. Tech.
ChEMBL_434567 (CHEMBL914214)
EC50
33000±n/a nM
Citation
 Carosati, EMannhold, RWahl, PHansen, JBFremming, TZamora, ICianchetta, GBaroni, M Virtual screening for novel openers of pancreatic K(ATP) channels. J Med Chem 50:2117-26 (2007)  
Target
Name:
ATP-binding cassette sub-family C member 8/ATP-sensitive inward rectifier potassium channel 11
Synonyms:
Potassium channel, inwardly rectifying, subfamily J, member 11/Sulfonylurea receptor 1 | Sulfonylurea receptor 1, Kir6.2
Type:
Mol. Mass.:
Description:
ASSAY_ID of EBI is 39363
Components:
This complex has 2 components.
Component 1
Name:
ATP-binding cassette sub-family C member 8
Synonyms:
ABCC8 ATP-binding cassette sub-family C member 8 HRINS SUR Sulfonylurea receptor 1 | Sulfonylurea receptors
Type:
PROTEIN
Mol. Mass.:
177013.37
Organism:
Homo sapiens (Human)
Description:
ChEMBL_1436733
Residue:
1581
  
Component 2
Name:
ATP-sensitive inward rectifier potassium channel 11
Synonyms:
ATP-sensitive inward rectifier potassium channel 11 Inward rectifier K(+) channel Kir6.2 KCNJ11 Potassium channel, inwardly rectifying, subfamily J, member 11 Sulfonylurea receptor 2, Kir6.2
Type:
Enzyme Catalytic Domain
Mol. Mass.:
43549.41
Organism:
Homo sapiens (Human)
Description:
Potassium channel (ATP modulatory) 0 0::Q14654
Residue:
390
  
Component 3
Name:
ATP-binding cassette sub-family C member 8
Synonyms:
ABCC8 ATP-binding cassette sub-family C member 8 HRINS SUR Sulfonylurea receptor 1 | Sulfonylurea receptors
Type:
PROTEIN
Mol. Mass.:
177013.37
Organism:
Homo sapiens (Human)
Description:
ChEMBL_1436733
Residue:
1581
  
Inhibitor
Name:
BDBM86248
Synonyms:
CAS_364-98-7 diazoxide
Type:
Small organic molecule
Emp. Form.:
C8H7ClN2O2S
Mol. Mass.:
230.671
SMILES:
CC1=Nc2ccc(Cl)cc2S(=O)(=O)N1
: