Target
C-X-C chemokine receptor type 1
Ligand
BDBM50211452
Substrate
Meas. Tech.
ChEMBL_455596 (CHEMBL886376)
Ki
11±n/a nM
Citation
 Chao, JTaveras, AGChao, JAki, CDwyer, MYu, YPurakkattle, BRindgen, DJakway, JHipkin, WFosetta, JFan, XLundell, DFine, JMinnicozzi, MPhillips, JMerritt, JR C(4)-alkyl substituted furanyl cyclobutenediones as potent, orally bioavailable CXCR2 and CXCR1 receptor antagonists. Bioorg Med Chem Lett 17:3778-83 (2007)  
Target
Name:
C-X-C chemokine receptor type 1
Synonyms:
C-X-C chemokine receptor type 1 (CXCR-1) CMKAR1 CXCR1_HUMAN Interleukin-8 receptor A | Interleukin-8 receptors, CXCR1/CXCR2
Type:
Enzyme
Mol. Mass.:
39803.83
Organism:
Homo sapiens (Human)
Description:
P25024
Residue:
350
  
Inhibitor
Name:
BDBM50211452
Synonyms:
(R)-2-hydroxy-3-(2-(1-(4-isopropylfuran-2-yl)-2-methylpropylamino)-3,4-dioxocyclobut-1-enylamino)-N,N-dimethylbenzamide | CHEMBL247149
Type:
Small organic molecule
Emp. Form.:
C24H29N3O5
Mol. Mass.:
439.5042
SMILES:
CC(C)[C@@H](Nc1c(Nc2cccc(C(=O)N(C)C)c2O)c(=O)c1=O)c1cc(co1)C(C)C
: