Target
Lysophosphatidic acid receptor 1
Ligand
BDBM50211652
Substrate
Meas. Tech.
ChEMBL_455637 (CHEMBL903635)
IC50
>40000±n/a nM
Citation
 Yamamoto, TFujita, KAsari, SChiba, AKataba, YOhsumi, KOhmuta, NIida, YIjichi, CIwayama, SFukuchi, NShoji, M Synthesis and evaluation of isoxazole derivatives as lysophosphatidic acid (LPA) antagonists. Bioorg Med Chem Lett 17:3736-40 (2007)  
Target
Name:
Lysophosphatidic acid receptor 1
Synonyms:
EDG2 LPA-1 LPAR1 Lysophosphatidic acid receptor 1 (LPA1) | Lysophosphatidic acid receptor Edg-2
Type:
Enzyme
Mol. Mass.:
41120.55
Organism:
Homo sapiens (Human)
Description:
Q92633
Residue:
364
  
Inhibitor
Name:
BDBM50211652
Synonyms:
3-{2'-[1-(2-chloro-phenyl)-ethoxycarbonylamino]-biphenyl-4-ylmethylsulfanyl}-propionic acid | CHEMBL245895
Type:
Small organic molecule
Emp. Form.:
C25H24ClNO4S
Mol. Mass.:
469.98
SMILES:
CC(OC(=O)Nc1ccccc1-c1ccc(CSCCC(O)=O)cc1)c1ccccc1Cl
: