Target
Lysophosphatidic acid receptor 1
Ligand
BDBM50211650
Substrate
Meas. Tech.
ChEMBL_455637 (CHEMBL903635)
IC50
130±n/a nM
Citation
 Yamamoto, TFujita, KAsari, SChiba, AKataba, YOhsumi, KOhmuta, NIida, YIjichi, CIwayama, SFukuchi, NShoji, M Synthesis and evaluation of isoxazole derivatives as lysophosphatidic acid (LPA) antagonists. Bioorg Med Chem Lett 17:3736-40 (2007)  
Target
Name:
Lysophosphatidic acid receptor 1
Synonyms:
EDG2 LPA-1 LPAR1 Lysophosphatidic acid receptor 1 (LPA1) | Lysophosphatidic acid receptor Edg-2
Type:
Enzyme
Mol. Mass.:
41120.55
Organism:
Homo sapiens (Human)
Description:
Q92633
Residue:
364
  
Inhibitor
Name:
BDBM50211650
Synonyms:
3-(4-(4-((1-(2-chlorocyclopent-1-enyl)ethoxy)carbonyl)isoxazol-3-yl)benzylthio)propanoic acid | CHEMBL247959
Type:
Small organic molecule
Emp. Form.:
C21H23ClN2O5S
Mol. Mass.:
450.936
SMILES:
CC(OC(=O)Nc1conc1-c1ccc(CSCCC(O)=O)cc1)C1=C(Cl)CCC1
: