Target
Retinoic acid receptor RXR-alpha
Ligand
BDBM50212266
Substrate
Meas. Tech.
ChEMBL_455695 (CHEMBL886478)
EC50
2.1±n/a nM
Citation
 Lagu, BPio, BLebedev, RYang, MPelton, PD RXR-LXR heterodimer modulators for the potential treatment of dyslipidemia. Bioorg Med Chem Lett 17:3497-503 (2007)  
Target
Name:
Retinoic acid receptor RXR-alpha
Synonyms:
NR2B1 Nuclear receptor subfamily 4 group A member 2 RXRA Retinoic acid receptor RXR-alpha/gamma Retinoid receptor
Type:
PROTEIN
Mol. Mass.:
50820.38
Organism:
Homo sapiens (Human)
Description:
ChEMBL_1456363
Residue:
462
  
Inhibitor
Name:
BDBM50212266
Synonyms:
3-(4-(trifluoromethoxy)-3-(4,4,6-trimethyl-2-oxo-1-propyl-1,2,3,4-tetrahydroquinolin-7-yl)phenyl)acrylic acid | CHEMBL246629
Type:
Small organic molecule
Emp. Form.:
C25H26F3NO4
Mol. Mass.:
461.4734
SMILES:
CCCN1C(=O)CC(C)(C)c2cc(C)c(cc12)-c1cc(\C=C\C(O)=O)ccc1OC(F)(F)F
: