Target
Proto-oncogene tyrosine-protein kinase receptor Ret
Ligand
BDBM50214110
Substrate
Meas. Tech.
ChEMBL_456269 (CHEMBL888279)
IC50
1000±n/a nM
Citation
 Lin, RConnolly, PJLu, YChiu, GLi, SYu, YHuang, SLi, XEmanuel, SLMiddleton, SAGruninger, RHAdams, MFuentes-Pesquera, ARGreenberger, LM Synthesis and evaluation of pyrazolo[3,4-b]pyridine CDK1 inhibitors as anti-tumor agents. Bioorg Med Chem Lett 17:4297-302 (2007)  
Target
Name:
Proto-oncogene tyrosine-protein kinase receptor Ret
Synonyms:
CDHF12 Cadherin family member 12 Proto-oncogene c-Ret RET51 Tyrosine-protein kinase Ret (RET)
Type:
Protein
Mol. Mass.:
124318.29
Organism:
Homo sapiens (Human)
Description:
P07949
Residue:
1114
  
Inhibitor
Name:
BDBM50214110
Synonyms:
4-(3-(5-morpholino-1H-benzo[d]imidazol-2-yl)-1H-pyrazolo[3,4-b]pyridin-5-yl)isoquinoline | CHEMBL249500
Type:
Small organic molecule
Emp. Form.:
C26H21N7O
Mol. Mass.:
447.4912
SMILES:
C1CN(CCO1)c1ccc2nc([nH]c2c1)-c1n[nH]c2ncc(cc12)-c1cncc2ccccc12
: