Target
Cyclin-dependent kinase 1
Ligand
BDBM50214111
Substrate
Meas. Tech.
ChEMBL_456265 (CHEMBL888275)
IC50
5.6±n/a nM
Citation
 Lin, RConnolly, PJLu, YChiu, GLi, SYu, YHuang, SLi, XEmanuel, SLMiddleton, SAGruninger, RHAdams, MFuentes-Pesquera, ARGreenberger, LM Synthesis and evaluation of pyrazolo[3,4-b]pyridine CDK1 inhibitors as anti-tumor agents. Bioorg Med Chem Lett 17:4297-302 (2007)  
Target
Name:
Cyclin-dependent kinase 1
Synonyms:
CDC2 CDK1 CDKN1 Cell division protein kinase 1 P34CDC2 | p34 protein kinase
Type:
Enzyme Subunit
Mol. Mass.:
34101.08
Organism:
Homo sapiens (Human)
Description:
P06493
Residue:
297
  
Inhibitor
Name:
BDBM50214111
Synonyms:
4-(3-(4-(methoxymethyl)-1H-benzo[d]imidazol-2-yl)-1H-pyrazolo[3,4-b]pyridin-5-yl)isoquinoline | CHEMBL248891
Type:
Small organic molecule
Emp. Form.:
C24H18N6O
Mol. Mass.:
406.4393
SMILES:
COCc1cccc2nc([nH]c12)-c1[nH]nc2ncc(cc12)-c1cncc2ccccc12
: