Target
Vascular endothelial growth factor receptor 2
Ligand
BDBM50214099
Substrate
Meas. Tech.
ChEMBL_456266 (CHEMBL888276)
IC50
25±n/a nM
Citation
 Lin, RConnolly, PJLu, YChiu, GLi, SYu, YHuang, SLi, XEmanuel, SLMiddleton, SAGruninger, RHAdams, MFuentes-Pesquera, ARGreenberger, LM Synthesis and evaluation of pyrazolo[3,4-b]pyridine CDK1 inhibitors as anti-tumor agents. Bioorg Med Chem Lett 17:4297-302 (2007)  
Target
Name:
Vascular endothelial growth factor receptor 2
Synonyms:
CD_antigen=CD309 Fetal liver kinase 1 (FLK-1) KDR Protein-tyrosine kinase receptor Flk-1 VEGFR-2 VEGFR2 Vascular Endothelial Growth Factor Receptor Kinase 2 Vascular endothelial growth factor receptor 2 (KDR) Vascular endothelial growth factor receptor 2 (VEGFR2) Vascular endothelial growth factor receptor-2 (VEGFR-2)
Type:
Receptor Tyrosine Kinase
Mol. Mass.:
151510.97
Organism:
Homo sapiens (Human)
Description:
P35968
Residue:
1356
  
Inhibitor
Name:
BDBM50214099
Synonyms:
CHEMBL400569 | N-((5-(3-(5-(4-methylpiperazin-1-yl)-1H-benzo[d]imidazol-2-yl)-1H-pyrazolo[3,4-b]pyridin-5-yl)pyridin-3-yl)methyl)ethanamine
Type:
Small organic molecule
Emp. Form.:
C26H29N9
Mol. Mass.:
467.5688
SMILES:
CCNCc1cncc(c1)-c1cnc2[nH]nc(-c3nc4ccc(cc4[nH]3)N3CCN(C)CC3)c2c1
: