Target
Cyclin-dependent kinase 1
Ligand
BDBM50214118
Substrate
Meas. Tech.
ChEMBL_456265 (CHEMBL888275)
IC50
110±n/a nM
Citation
 Lin, RConnolly, PJLu, YChiu, GLi, SYu, YHuang, SLi, XEmanuel, SLMiddleton, SAGruninger, RHAdams, MFuentes-Pesquera, ARGreenberger, LM Synthesis and evaluation of pyrazolo[3,4-b]pyridine CDK1 inhibitors as anti-tumor agents. Bioorg Med Chem Lett 17:4297-302 (2007)  
Target
Name:
Cyclin-dependent kinase 1
Synonyms:
CDC2 CDK1 CDKN1 Cell division protein kinase 1 P34CDC2 | p34 protein kinase
Type:
Enzyme Subunit
Mol. Mass.:
34101.08
Organism:
Homo sapiens (Human)
Description:
P06493
Residue:
297
  
Inhibitor
Name:
BDBM50214118
Synonyms:
CHEMBL249519 | N-((5-(3-(4-(methoxymethyl)-1H-benzo[d]imidazol-2-yl)-1H-pyrazolo[3,4-b]pyridin-5-yl)-4-methylpyridin-3-yl)methyl)ethanamine
Type:
Small organic molecule
Emp. Form.:
C24H25N7O
Mol. Mass.:
427.5016
SMILES:
CCNCc1cncc(-c2cnc3[nH]nc(-c4nc5cccc(COC)c5[nH]4)c3c2)c1C
: