Target
Prostaglandin G/H synthase 2
Ligand
BDBM22360
Substrate
Meas. Tech.
ChEMBL_437305 (CHEMBL906707)
IC50
100000±n/a nM
Citation
 Handler, NBrunhofer, GStudenik, CLeisser, KJaeger, WParth, SErker, T 'Bridged' stilbene derivatives as selective cyclooxygenase-1 inhibitors. Bioorg Med Chem 15:6109-18 (2007)  
Target
Name:
Prostaglandin G/H synthase 2
Synonyms:
COX2 Cyclooxygenase 2 (COX-2) Cyclooxygenase-2 (COX-2 AA) Cyclooxygenase-2 (COX-2) PGH2_HUMAN PHS II Prostaglandin E synthase/G/H synthase 2 Prostaglandin-endoperoxide synthase 2
Type:
Enzyme
Mol. Mass.:
69003.89
Organism:
Homo sapiens (Human)
Description:
Recombinant Cox-2 provided by Cayman (Cayman Chemical Co.,Ann Arbor, MI).
Residue:
604
  
Inhibitor
Name:
BDBM22360
Synonyms:
2-(acetyloxy)benzoate Acetylsalicylic acid Endosprin Zorprin cid_2244
Type:
Anti-Inflammatory Agents, Non-Steroidal
Emp. Form.:
C9H8O4
Mol. Mass.:
180.1574
SMILES:
CC(=O)Oc1ccccc1C(O)=O
: