Target
D(3) dopamine receptor
Ligand
BDBM50219111
Substrate
Meas. Tech.
ChEMBL_445362 (CHEMBL895652)
IC50
5.4±n/a nM
Citation
 Grundt, PPrevatt, KMCao, JTaylor, MFloresca, CZChoi, JKJenkins, BGLuedtke, RRNewman, AH Heterocyclic analogues of N-(4-(4-(2,3-dichlorophenyl)piperazin-1-yl)butyl)arylcarboxamides with functionalized linking chains as novel dopamine D3 receptor ligands: potential substance abuse therapeutic agents. J Med Chem 50:4135-46 (2007)  
Target
Name:
D(3) dopamine receptor
Synonyms:
DOPAMINE D3 DRD3_HUMAN Dopamine D3 receptor (D3) Dopamine receptor Dopamine receptor D3
Type:
Mol. Mass.:
44243.43
Organism:
Homo sapiens (Human)
Description:
Residue:
400
  
Inhibitor
Name:
BDBM50219111
Synonyms:
CHEMBL390253 | N-(4-(4-(2,3-dichlorophenyl)piperazin-1-yl)-2-hydroxybutyl)-4-(pyridin-2-yl)benzamide
Type:
Small organic molecule
Emp. Form.:
C26H28Cl2N4O2
Mol. Mass.:
499.432
SMILES:
OC(CCN1CCN(CC1)c1cccc(Cl)c1Cl)CNC(=O)c1ccc(cc1)-c1ccccn1
: