Target
Cholinesterase
Ligand
BDBM50219233
Substrate
Meas. Tech.
ChEMBL_437418 (CHEMBL906816)
IC50
1350±n/a nM
Citation
 Kwon, YEPark, JYNo, KTShin, JHLee, SKEun, JSYang, JHShin, TYKim, DKChae, BSLeem, JYKim, KH Synthesis, in vitro assay, and molecular modeling of new piperidine derivatives having dual inhibitory potency against acetylcholinesterase and Abeta1-42 aggregation for Alzheimer's disease therapeutics. Bioorg Med Chem 15:6596-607 (2007)  
Target
Name:
Cholinesterase
Synonyms:
Acylcholine acylhydrolase Butyrylcholine esterase (BChE) Butyrylcholinesterase (BuChE) CHLE_HUMAN Cholinesterases Pseudocholinesterase
Type:
Homotetramer
Mol. Mass.:
68422.27
Organism:
Homo sapiens (Human)
Description:
P06276
Residue:
602
  
Inhibitor
Name:
BDBM50219233
Synonyms:
4-[4-(benzyloxy)piperidino]butyl-3-chlorobenzoate | CHEMBL389049
Type:
Small organic molecule
Emp. Form.:
C23H28ClNO3
Mol. Mass.:
401.926
SMILES:
Clc1cccc(c1)C(=O)OCCCCN1CCC(CC1)OCc1ccccc1
: