Target
Acetylcholinesterase
Ligand
BDBM50219242
Substrate
Meas. Tech.
ChEMBL_437417 (CHEMBL906815)
IC50
2450±n/a nM
Citation
 Kwon, YEPark, JYNo, KTShin, JHLee, SKEun, JSYang, JHShin, TYKim, DKChae, BSLeem, JYKim, KH Synthesis, in vitro assay, and molecular modeling of new piperidine derivatives having dual inhibitory potency against acetylcholinesterase and Abeta1-42 aggregation for Alzheimer's disease therapeutics. Bioorg Med Chem 15:6596-607 (2007)  
Target
Name:
Acetylcholinesterase
Synonyms:
ACES_ELEEL Acetylcholinesterase (EeAChE) | ache
Type:
Enzyme
Mol. Mass.:
71812.79
Organism:
Electrophorus electricus (Electric eel)
Description:
Residue:
633
  
Inhibitor
Name:
BDBM50219242
Synonyms:
4-[4-(benzhydryloxy)piperidino]butyl-N-(4-chlorophenyl)carbamate | CHEMBL389047
Type:
Small organic molecule
Emp. Form.:
C29H33ClN2O3
Mol. Mass.:
493.037
SMILES:
Clc1ccc(NC(=O)OCCCCN2CCC(CC2)OC(c2ccccc2)c2ccccc2)cc1
: