Target
Acetylcholinesterase
Ligand
BDBM50219247
Substrate
Meas. Tech.
ChEMBL_437417 (CHEMBL906815)
IC50
12220±n/a nM
Citation
 Kwon, YEPark, JYNo, KTShin, JHLee, SKEun, JSYang, JHShin, TYKim, DKChae, BSLeem, JYKim, KH Synthesis, in vitro assay, and molecular modeling of new piperidine derivatives having dual inhibitory potency against acetylcholinesterase and Abeta1-42 aggregation for Alzheimer's disease therapeutics. Bioorg Med Chem 15:6596-607 (2007)  
Target
Name:
Acetylcholinesterase
Synonyms:
ACES_ELEEL Acetylcholinesterase (EeAChE) | ache
Type:
Enzyme
Mol. Mass.:
71812.79
Organism:
Electrophorus electricus (Electric eel)
Description:
Residue:
633
  
Inhibitor
Name:
BDBM50219247
Synonyms:
4-[4-(benzyloxy)piperidino]butyl-4-(tert-butyl)-benzoate | CHEMBL228302
Type:
Small organic molecule
Emp. Form.:
C27H37NO3
Mol. Mass.:
423.5876
SMILES:
CC(C)(C)c1ccc(cc1)C(=O)OCCCCN1CCC(CC1)OCc1ccccc1
: