Target
D(3) dopamine receptor
Ligand
BDBM50219939
Substrate
Meas. Tech.
ChEMBL_449063 (CHEMBL898268)
IC50
0.2±n/a nM
Citation
 Agai-Csongor, ENógrádi, KGalambos, JVágó, IBielik, AMagdó, IIgnácz-Szendrei, GKeseru, GMGreiner, ILaszlovszky, ISchmidt, EKiss, BSághy, KLaszy, JGyertyán, IZájer-Balázs, MGémesi, LDomány, G Novel sulfonamides having dual dopamine D2 and D3 receptor affinity show in vivo antipsychotic efficacy with beneficial cognitive and EPS profile. Bioorg Med Chem Lett 17:5340-4 (2007)  
Target
Name:
D(3) dopamine receptor
Synonyms:
DOPAMINE D3 Dopamine D3 receptor | Drd3
Type:
Protein
Mol. Mass.:
49540.58
Organism:
Rattus norvegicus (Rat)
Description:
P19020
Residue:
446
  
Inhibitor
Name:
BDBM50219939
Synonyms:
CHEMBL240693 | N-((1r,4r)-4-(2-(4-(2,3-dichlorophenyl)piperazin-1-yl)ethyl)cyclohexyl)pyridine-3-sulfonamide
Type:
Small organic molecule
Emp. Form.:
C23H30Cl2N4O2S
Mol. Mass.:
497.481
SMILES:
Clc1cccc(N2CCN(CC[C@H]3CC[C@@H](CC3)NS(=O)(=O)c3cccnc3)CC2)c1Cl
: