Target
Glutamate receptor ionotropic, NMDA 2B
Ligand
BDBM50220591
Substrate
Meas. Tech.
ChEMBL_457343 (CHEMBL940934)
Ki
8.9±n/a nM
Citation
 Kawai, MSakurada, IMorita, AIwamuro, YAndo, KOmura, HSakakibara, SMasuda, TKoike, HHonma, THattori, KTakashima, TMizuno, KMizutani, MKawamura, M Structure-activity relationship study of novel NR2B-selective antagonists with arylamides to avoid reactive metabolites formation. Bioorg Med Chem Lett 17:5537-42 (2007)  
Target
Name:
Glutamate receptor ionotropic, NMDA 2B
Synonyms:
GluN2B Grin2b NMDA receptor subunit N2B (GluN2B) NMDE2_RAT | NR2B
Type:
Protein
Mol. Mass.:
166077.66
Organism:
Rattus norvegicus (Rat)
Description:
Q00960
Residue:
1482
  
Inhibitor
Name:
BDBM50220591
Synonyms:
CHEMBL249909 | N-(((1s,4s)-4-(2-phenoxyethyl)cyclohexyl)methyl)-1H-pyrazole-3-carboxamide
Type:
Small organic molecule
Emp. Form.:
C19H25N3O2
Mol. Mass.:
327.4207
SMILES:
O=C(NC[C@@H]1CC[C@H](CCOc2ccccc2)CC1)c1ccn[nH]1
: