Target
Melanocortin receptor 4
Ligand
BDBM50220696
Substrate
Meas. Tech.
ChEMBL_457383 (CHEMBL941902)
IC50
3.6±n/a nM
Citation
 Sebhat, IKLai, YBarakat, KYe, ZTang, RKalyani, RNVongs, AMacneil, TWeinberg, DHCabello, MAMaroto, MTeran, AFong, TMVan der Ploeg, LHPatchett, AANargund, RP Melanocortin subtype 4 receptor agonists: structure-activity relationships about the 4-alkyl piperidine core. Bioorg Med Chem Lett 17:5720-3 (2007)  
Target
Name:
Melanocortin receptor 4
Synonyms:
MC4-R MC4R_HUMAN Melanocortin receptor 4 (MC-4) Melanocortin receptor 4 (MC4R)
Type:
Enzyme
Mol. Mass.:
36949.50
Organism:
Homo sapiens (Human)
Description:
P32245
Residue:
332
  
Inhibitor
Name:
BDBM50220696
Synonyms:
(R)-N-((S)-3-(4-chlorophenyl)-1-(4-((1-methyl-1H-tetrazol-5-yl)methyl)-4-neopentylpiperidin-1-yl)-1-oxopropan-2-yl)-1,2,3,4-tetrahydroisoquinoline-3-carboxamide | CHEMBL400252
Type:
Small organic molecule
Emp. Form.:
C32H42ClN7O2
Mol. Mass.:
592.175
SMILES:
Cn1nnnc1CC1(CC(C)(C)C)CCN(CC1)C(=O)[C@H](Cc1ccc(Cl)cc1)NC(=O)[C@H]1Cc2ccccc2CN1
: