Target
Glutamate receptor ionotropic, NMDA 2B
Ligand
BDBM50220724
Substrate
Meas. Tech.
ChEMBL_449356 (CHEMBL899623)
IC50
>5000±n/a nM
Citation
 Kawai, MNakamura, HSakurada, IShimokawa, HTanaka, HMatsumizu, MAndo, KHattori, KOhta, ANukui, SOmura, AKawamura, M Discovery of novel and orally active NR2B-selective N-methyl-D-aspartate (NMDA) antagonists, pyridinol derivatives with reduced HERG binding affinity. Bioorg Med Chem Lett 17:5533-6 (2007)  
Target
Name:
Glutamate receptor ionotropic, NMDA 2B
Synonyms:
GluN2B Grin2b NMDA receptor subunit N2B (GluN2B) NMDE2_RAT | NR2B
Type:
Protein
Mol. Mass.:
166077.66
Organism:
Rattus norvegicus (Rat)
Description:
Q00960
Residue:
1482
  
Inhibitor
Name:
BDBM50220724
Synonyms:
CHEMBL237963 | N-((1s,4s)-4-hydroxy-4-(6-(methylsulfonamido)pyridin-3-yl)cyclohexyl)-3-phenylpropanamide
Type:
Small organic molecule
Emp. Form.:
C21H27N3O4S
Mol. Mass.:
417.522
SMILES:
CS(=O)(=O)Nc1ccc(cn1)[C@@]1(O)CC[C@@H](CC1)NC(=O)CCc1ccccc1
: