Target
Potassium voltage-gated channel subfamily H member 2
Ligand
BDBM50220730
Substrate
Meas. Tech.
ChEMBL_449357 (CHEMBL899624)
IC50
1100±n/a nM
Citation
 Kawai, MNakamura, HSakurada, IShimokawa, HTanaka, HMatsumizu, MAndo, KHattori, KOhta, ANukui, SOmura, AKawamura, M Discovery of novel and orally active NR2B-selective N-methyl-D-aspartate (NMDA) antagonists, pyridinol derivatives with reduced HERG binding affinity. Bioorg Med Chem Lett 17:5533-6 (2007)  
Target
Name:
Potassium voltage-gated channel subfamily H member 2
Synonyms:
1,3-beta-glucan synthase component GLS2 ERG Eag-related protein 1 Ether-a-go-go-related gene (HERG) Ether-a-go-go-related gene potassium channel 1 Ether-a-go-go-related gene potassium channel 1 (hERG1) Ether-a-go-go-related protein 1 H-ERG KCNH2 Potassium voltage-gated channel subfamily H member 2 (hERG) Voltage-gated potassium channel subunit Kv11.1 hERG Potassium Channel 1 | putative potassium channel subunit
Type:
Multi-pass membrane protein
Mol. Mass.:
126672.65
Organism:
Homo sapiens (Human)
Description:
Q12809
Residue:
1159
  
Inhibitor
Name:
BDBM50220730
Synonyms:
(R)-6-(2-(4-(3-fluorophenyl)-4-hydroxypiperidin-1-yl)-1-hydroxyethyl)-3,4-dihydroquinolin-2(1H)-one | CHEMBL237793
Type:
Small organic molecule
Emp. Form.:
C22H25FN2O3
Mol. Mass.:
384.4439
SMILES:
O[C@@H](CN1CCC(O)(CC1)c1cccc(F)c1)c1ccc2NC(=O)CCc2c1
: