Target
Adenosine receptor A1
Ligand
BDBM50221700
Substrate
Meas. Tech.
ChEMBL_449693 (CHEMBL898798)
Ki
25000±n/a nM
Citation
 Drabczynska, AMüller, CESchiedel, ASchumacher, BKarolak-Wojciechowska, JFruzinski, AZobnina, WYuzlenko, OKiec-Kononowicz, K Phenylethyl-substituted pyrimido[2,1-f]purinediones and related compounds: structure-activity relationships as adenosine A(1) and A(2A) receptor ligands. Bioorg Med Chem 15:6956-74 (2007)  
Target
Name:
Adenosine receptor A1
Synonyms:
AA1R_RAT ADENOSINE A1 high Adenosine A1 receptor (A1) Adenosine receptors A1 | Adora1
Type:
Protein
Mol. Mass.:
36704.13
Organism:
Rattus norvegicus (rat)
Description:
Residue:
326
  
Inhibitor
Name:
BDBM50221700
Synonyms:
9-(1-hydroxy-1-phenylpropan-2-yl)-1,3-dimethyl-6,7,8,9-tetrahydropyrimido[1,2-a]purine-2,4(1H,3H)-dione | CHEMBL392115
Type:
Small organic molecule
Emp. Form.:
C19H23N5O3
Mol. Mass.:
369.4176
SMILES:
CC(C(O)c1ccccc1)N1CCCn2c1nc1n(C)c(=O)n(C)c(=O)c21
: