Target
Proto-oncogene tyrosine-protein kinase Src
Ligand
BDBM50224378
Substrate
Meas. Tech.
ChEMBL_450769 (CHEMBL899855)
Ki
24000±n/a nM
Citation
 Manetti, FSantucci, ALocatelli, GAMaga, GSpreafico, ASerchi, TOrlandini, MBernardini, GCaradonna, NPSpallarossa, ABrullo, CSchenone, SBruno, ORanise, ABondavalli, FHoffmann, OBologna, MAngelucci, ABotta, M Identification of a novel pyrazolo[3,4-d]pyrimidine able to inhibit cell proliferation of a human osteogenic sarcoma in vitro and in a xenograft model in mice. J Med Chem 50:5579-88 (2007)  
Target
Name:
Proto-oncogene tyrosine-protein kinase Src
Synonyms:
Calmodulin/Proto-oncogene tyrosine-protein kinase Src Proto-oncogene c-Src SRC SRC_HUMAN V-src sarcoma (Schmidt-Ruppin A-2) viral oncogene homolog (avian) p60-Src | pp60c-src
Type:
Protein
Mol. Mass.:
59838.60
Organism:
Homo sapiens (Human)
Description:
P12931
Residue:
536
  
Inhibitor
Name:
BDBM50224378
Synonyms:
CHEMBL239192 | N-(4-chlorobenzyl)-1-(2-chloro-2-phenylethyl)-6-(methylthio)-1H-pyrazolo[3,4-d]pyrimidin-4-amine
Type:
Small organic molecule
Emp. Form.:
C21H19Cl2N5S
Mol. Mass.:
444.38
SMILES:
CSc1nc(NCc2ccc(Cl)cc2)c2cnn(CC(Cl)c3ccccc3)c2n1
: