Target
Metabotropic glutamate receptor 1
Ligand
BDBM50224392
Substrate
Meas. Tech.
ChEMBL_450774 (CHEMBL899859)
IC50
12±n/a nM
Citation
 Wu, WLBurnett, DADomalski, MGreenlee, WJLi, CBertorelli, RFredduzzi, SLozza, GVeltri, AReggiani, A Discovery of orally efficacious tetracyclic metabotropic glutamate receptor 1 (mGluR1) antagonists for the treatment of chronic pain. J Med Chem 50:5550-3 (2007)  
Target
Name:
Metabotropic glutamate receptor 1
Synonyms:
GPRC1A GRM1_HUMAN Metabotropic Glutamate 1a | metabotropic glutamate 1
Type:
Enzyme
Mol. Mass.:
132358.19
Organism:
Homo sapiens (Human)
Description:
Q13255
Residue:
1194
  
Inhibitor
Name:
BDBM50224392
Synonyms:
9-(4-chlorophenyl)-2,3-dihydro-2(S)-methyl-1H-pyrimido[4'',5'':4',5']thieno[3',2':5,6]pyrido[3,4-b][1,4]oxazin-8(9H)-one | CHEMBL393923
Type:
Small organic molecule
Emp. Form.:
C18H13ClN4O2S
Mol. Mass.:
384.839
SMILES:
C[C@H]1COc2cnc3sc4c(ncn(-c5ccc(Cl)cc5)c4=O)c3c2N1
: