Target
Metabotropic glutamate receptor 5
Ligand
BDBM50224395
Substrate
Meas. Tech.
ChEMBL_450775 (CHEMBL899860)
IC50
702±n/a nM
Citation
 Wu, WLBurnett, DADomalski, MGreenlee, WJLi, CBertorelli, RFredduzzi, SLozza, GVeltri, AReggiani, A Discovery of orally efficacious tetracyclic metabotropic glutamate receptor 1 (mGluR1) antagonists for the treatment of chronic pain. J Med Chem 50:5550-3 (2007)  
Target
Name:
Metabotropic glutamate receptor 5
Synonyms:
GPRC1E GRM5_HUMAN metabotropic glutamate 5 | metabotropic glutamate 5a
Type:
Enzyme
Mol. Mass.:
132484.72
Organism:
Homo sapiens (Human)
Description:
Residue:
1212
  
Inhibitor
Name:
BDBM50224395
Synonyms:
2,3-dihydro-9-(4-methylphenyl)-1H-pyrimido[4'',5'':4',5']thieno[3',2':5,6]pyrido[3,4-b][1,4]oxazin-8(9H)-one | CHEMBL235975
Type:
Small organic molecule
Emp. Form.:
C18H14N4O2S
Mol. Mass.:
350.394
SMILES:
Cc1ccc(cc1)-n1cnc2c(sc3ncc4OCCNc4c23)c1=O
: