Target
Metabotropic glutamate receptor 5
Ligand
BDBM50224390
Substrate
Meas. Tech.
ChEMBL_450775 (CHEMBL899860)
IC50
>1000±n/a nM
Citation
 Wu, WLBurnett, DADomalski, MGreenlee, WJLi, CBertorelli, RFredduzzi, SLozza, GVeltri, AReggiani, A Discovery of orally efficacious tetracyclic metabotropic glutamate receptor 1 (mGluR1) antagonists for the treatment of chronic pain. J Med Chem 50:5550-3 (2007)  
Target
Name:
Metabotropic glutamate receptor 5
Synonyms:
GPRC1E GRM5_HUMAN metabotropic glutamate 5 | metabotropic glutamate 5a
Type:
Enzyme
Mol. Mass.:
132484.72
Organism:
Homo sapiens (Human)
Description:
Residue:
1212
  
Inhibitor
Name:
BDBM50224390
Synonyms:
8-(4-methylphenyl)-1h-pyrrolo[2'',3'':4',5']pyrido[3',2':4,5]thieno[3,2-d]pyrimidin-7(8H)-one | CHEMBL393705
Type:
Small organic molecule
Emp. Form.:
C18H12N4OS
Mol. Mass.:
332.379
SMILES:
Cc1ccc(cc1)-n1cnc2c(sc3ncc4cc[nH]c4c23)c1=O
: