Target
Metabotropic glutamate receptor 1
Ligand
BDBM50224409
Substrate
Meas. Tech.
ChEMBL_450777 (CHEMBL899862)
Ki
9.1±n/a nM
Citation
 Wu, WLBurnett, DADomalski, MGreenlee, WJLi, CBertorelli, RFredduzzi, SLozza, GVeltri, AReggiani, A Discovery of orally efficacious tetracyclic metabotropic glutamate receptor 1 (mGluR1) antagonists for the treatment of chronic pain. J Med Chem 50:5550-3 (2007)  
Target
Name:
Metabotropic glutamate receptor 1
Synonyms:
GRM1_RAT Grm1 Metabotropic glutamate receptor Mglur1 metabotropic glutamate 1/5-D metabotropic glutamate receptor 1 isoform alpha precursor
Type:
Enzyme Catalytic Domain
Mol. Mass.:
133240.47
Organism:
RAT
Description:
metabotropic glutamate 1/2 0 RAT::P23385
Residue:
1199
  
Inhibitor
Name:
BDBM50224409
Synonyms:
9-(4-chlorophenyl)-2,3-dihydro-2(R)-methyl-1H-pyrimido[4'',5'':4',5']thieno[3',2':5,6]pyrido[3,4-b][1,4]oxazin-8(9H)-one | CHEMBL236178
Type:
Small organic molecule
Emp. Form.:
C18H13ClN4O2S
Mol. Mass.:
384.839
SMILES:
C[C@@H]1COc2cnc3sc4c(ncn(-c5ccc(Cl)cc5)c4=O)c3c2N1
: