Target
Oxysterols receptor LXR-beta
Ligand
BDBM20000
Substrate
Meas. Tech.
ChEMBL_461476 (CHEMBL927487)
EC50
90±n/a nM
Citation
 Hu, BQuinet, EUnwalla, RCollini, MJetter, JDooley, RAndraka, DNogle, LSavio, DHalpern, AGoos-Nilsson, AWilhelmsson, ANambi, PWrobel, J Carboxylic acid based quinolines as liver X receptor modulators that have LXRbeta receptor binding selectivity. Bioorg Med Chem Lett 18:54-9 (2008)  
Target
Name:
Oxysterols receptor LXR-beta
Synonyms:
LXRB Liver X, LXR beta NR1H2 Nuclear receptor NER Ubiquitously-expressed nuclear receptor
Type:
Enzyme Catalytic Domain
Mol. Mass.:
50978.79
Organism:
Homo sapiens (Human)
Description:
P55055
Residue:
460
  
Inhibitor
Name:
BDBM20000
Synonyms:
2-(4-{3-[3-benzyl-8-(trifluoromethyl)quinolin-4-yl]phenoxymethyl}phenyl)acetic acid JMC496151 Compound 15 | WAY-254011
Type:
Small organic molecule
Emp. Form.:
C32H24F3NO3
Mol. Mass.:
527.5331
SMILES:
OC(=O)Cc1ccc(COc2cccc(c2)-c2c(Cc3ccccc3)cnc3c(cccc23)C(F)(F)F)cc1
: