Target
Oxysterols receptor LXR-alpha
Ligand
BDBM20000
Substrate
Meas. Tech.
ChEMBL_461473 (CHEMBL927484)
IC50
10±n/a nM
Citation
 Hu, BQuinet, EUnwalla, RCollini, MJetter, JDooley, RAndraka, DNogle, LSavio, DHalpern, AGoos-Nilsson, AWilhelmsson, ANambi, PWrobel, J Carboxylic acid based quinolines as liver X receptor modulators that have LXRbeta receptor binding selectivity. Bioorg Med Chem Lett 18:54-9 (2008)  
Target
Name:
Oxysterols receptor LXR-alpha
Synonyms:
LXRA Liver X receptor alpha Liver X receptor alpha (NR1H3) NR1H3 Nuclear orphan receptor LXR-alpha | Nuclear receptor subfamily 1 group H member 3
Type:
Enzyme Catalytic Domain
Mol. Mass.:
50403.85
Organism:
Homo sapiens (Human)
Description:
Q13133
Residue:
447
  
Inhibitor
Name:
BDBM20000
Synonyms:
2-(4-{3-[3-benzyl-8-(trifluoromethyl)quinolin-4-yl]phenoxymethyl}phenyl)acetic acid JMC496151 Compound 15 | WAY-254011
Type:
Small organic molecule
Emp. Form.:
C32H24F3NO3
Mol. Mass.:
527.5331
SMILES:
OC(=O)Cc1ccc(COc2cccc(c2)-c2c(Cc3ccccc3)cnc3c(cccc23)C(F)(F)F)cc1
: