Target
Oxysterols receptor LXR-alpha
Ligand
BDBM50227151
Substrate
Meas. Tech.
ChEMBL_461478 (CHEMBL927489)
EC50
685±n/a nM
Citation
 Hu, BQuinet, EUnwalla, RCollini, MJetter, JDooley, RAndraka, DNogle, LSavio, DHalpern, AGoos-Nilsson, AWilhelmsson, ANambi, PWrobel, J Carboxylic acid based quinolines as liver X receptor modulators that have LXRbeta receptor binding selectivity. Bioorg Med Chem Lett 18:54-9 (2008)  
Target
Name:
Oxysterols receptor LXR-alpha
Synonyms:
LXRA Liver X receptor alpha Liver X receptor alpha (NR1H3) NR1H3 Nuclear orphan receptor LXR-alpha | Nuclear receptor subfamily 1 group H member 3
Type:
Enzyme Catalytic Domain
Mol. Mass.:
50403.85
Organism:
Homo sapiens (Human)
Description:
Q13133
Residue:
447
  
Inhibitor
Name:
BDBM50227151
Synonyms:
2-(5-(3-(3-benzyl-8-(trifluoromethyl)quinolin-4-yl)benzylamino)naphthalen-1-yl)acetic acid | CHEMBL253311
Type:
Small organic molecule
Emp. Form.:
C36H27F3N2O2
Mol. Mass.:
576.607
SMILES:
OC(=O)Cc1cccc2c(NCc3cccc(c3)-c3c(Cc4ccccc4)cnc4c(cccc34)C(F)(F)F)cccc12
: