Target
Sialidase-2
Ligand
BDBM4706
Substrate
Meas. Tech.
ChEMBL_461855 (CHEMBL927848)
IC50
43000±n/a nM
Citation
 Magesh, SMoriya, SSuzuki, TMiyagi, TIshida, HKiso, M Design, synthesis, and biological evaluation of human sialidase inhibitors. Part 1: selective inhibitors of lysosomal sialidase (NEU1). Bioorg Med Chem Lett 18:532-7 (2008)  
Target
Name:
Sialidase-2
Synonyms:
Cytosolic sialidase NEU2 Sialidase 2 | Sialidase-2
Type:
PROTEIN
Mol. Mass.:
42256.20
Organism:
Homo sapiens (Human)
Description:
ChEMBL_960638
Residue:
380
  
Inhibitor
Name:
BDBM4706
Synonyms:
(2R,3R,4S)-3-acetamido-4-hydroxy-2-[(1R,2R)-1,2,3-trihydroxypropyl]-3,4-dihydro-2H-pyran-6-carboxylic acid CHEMBL96712 Neu5Ac2en
Type:
Small organic molecule
Emp. Form.:
C11H17NO8
Mol. Mass.:
291.2546
SMILES:
CC(=O)N[C@@H]1[C@@H](O)C=C(O[C@H]1[C@H](O)[C@H](O)CO)C(O)=O
: