Target
Sialidase-3
Ligand
BDBM4706
Substrate
Meas. Tech.
ChEMBL_461856 (CHEMBL927849)
IC50
61000±n/a nM
Citation
 Magesh, SMoriya, SSuzuki, TMiyagi, TIshida, HKiso, M Design, synthesis, and biological evaluation of human sialidase inhibitors. Part 1: selective inhibitors of lysosomal sialidase (NEU1). Bioorg Med Chem Lett 18:532-7 (2008)  
Target
Name:
Sialidase-3
Synonyms:
NEU3 Sialidase 3 | Sialidase-3
Type:
PROTEIN
Mol. Mass.:
48257.99
Organism:
Homo sapiens (Human)
Description:
ChEMBL_461856
Residue:
428
  
Inhibitor
Name:
BDBM4706
Synonyms:
(2R,3R,4S)-3-acetamido-4-hydroxy-2-[(1R,2R)-1,2,3-trihydroxypropyl]-3,4-dihydro-2H-pyran-6-carboxylic acid CHEMBL96712 Neu5Ac2en
Type:
Small organic molecule
Emp. Form.:
C11H17NO8
Mol. Mass.:
291.2546
SMILES:
CC(=O)N[C@@H]1[C@@H](O)C=C(O[C@H]1[C@H](O)[C@H](O)CO)C(O)=O
: