Target
Beta-secretase 1
Ligand
BDBM50231481
Substrate
Meas. Tech.
ChEMBL_462009 (CHEMBL944852)
IC50
5600±n/a nM
Citation
 Cole, DCStock, JRChopra, RCowling, REllingboe, JWFan, KYHarrison, BLHu, YJacobsen, SJennings, LDJin, GLohse, PAMalamas, MSManas, ESMoore, WJO'Donnell, MMOlland, AMRobichaud, AJSvenson, KWu, JWagner, EBard, J Acylguanidine inhibitors of beta-secretase: optimization of the pyrrole ring substituents extending into the S1 and S3 substrate binding pockets. Bioorg Med Chem Lett 18:1063-6 (2008)  
Target
Name:
Beta-secretase 1
Synonyms:
ASP2 Aspartyl protease 2 BACE1 Beta-secretase (BACE) Beta-secretase 1 (BACE 1) Beta-secretase 1 (BACE1) Beta-site amyloid precursor protein cleaving enzyme 1 Memapsin-2 beta-Secretase (BACE-1) | beta-Secretase (BACE1)
Type:
Protein
Mol. Mass.:
55755.10
Organism:
Homo sapiens (Human)
Description:
P56817
Residue:
501
  
Inhibitor
Name:
BDBM50231481
Synonyms:
3-bromo-N-(4-(1-(2-guanidino-2-oxoethyl)-5-phenyl-1H-pyrrol-2-yl)phenyl)benzamide 3-bromo-N-{4-[1-(2-guanidino-2-oxo-ethyl)-5-phenyl-1H-pyrrol-2-yl]-phenyl}-benzamide | CHEMBL252189
Type:
Small organic molecule
Emp. Form.:
C26H22BrN5O2
Mol. Mass.:
516.389
SMILES:
NC(=N)NC(=O)Cn1c(ccc1-c1ccc(NC(=O)c2cccc(Br)c2)cc1)-c1ccccc1
: