Target
Oxysterols receptor LXR-alpha
Ligand
BDBM20177
Substrate
Meas. Tech.
ChEMBL_551128 (CHEMBL1007709)
EC50
>15000±n/a nM
Citation
 Jayasuriya, HHerath, KBOndeyka, JGGuan, ZBorris, RPTiwari, Sde Jong, WChavez, FMoss, JStevenson, DWBeck, HTSlattery, MZamora, NSchulman, MAli, ASharma, NMacNaul, KHayes, NMenke, JGSingh, SB Diterpenoid, steroid, and triterpenoid agonists of liver X receptors from diversified terrestrial plants and marine sources. J Nat Prod 68:1247-52 (2005)  
Target
Name:
Oxysterols receptor LXR-alpha
Synonyms:
LXRA Liver X receptor alpha Liver X receptor alpha (NR1H3) NR1H3 Nuclear orphan receptor LXR-alpha | Nuclear receptor subfamily 1 group H member 3
Type:
Enzyme Catalytic Domain
Mol. Mass.:
50403.85
Organism:
Homo sapiens (Human)
Description:
Q13133
Residue:
447
  
Inhibitor
Name:
BDBM20177
Synonyms:
(1S,2R,5S,10S,11S,14R,15S)-14-[(2S,3R)-3-hydroxy-6-methylheptan-2-yl]-2,15-dimethyltetracyclo[8.7.0.0^{2,7}.0^{11,15}]heptadec-7-en-5-ol CHEMBL422904
Type:
Steroid
Emp. Form.:
C27H46O2
Mol. Mass.:
402.6529
SMILES:
[H][C@@](O)(CCC(C)C)[C@@H](C)[C@@]1([H])CC[C@@]2([H])[C@]3([H])CC=C4C[C@@]([H])(O)CC[C@]4(C)[C@@]3([H])CC[C@]12C
: