Target
Matrix metalloproteinase-9
Ligand
BDBM50031795
Substrate
Meas. Tech.
ChEMBL_510908 (CHEMBL1007242)
IC50
0.380000±n/a nM
Citation
 Campestre, CTortorella, PAgamennone, MPreziuso, SBiasone, ANuti, ERossello, AGallina, C Peptidyl 3-substituted 1-hydroxyureas as isosteric analogues of succinylhydroxamate MMP inhibitors. Eur J Med Chem 43:1008-14 (2008)  
Target
Name:
Matrix metalloproteinase-9
Synonyms:
67 kDa matrix metalloproteinase-9 92 kDa gelatinase CLG4B Gelatinase B MMP9 Matrix metalloproteinase 9 (MMP-9) Matrix metalloproteinase-9 (MMP9)
Type:
Enzyme
Mol. Mass.:
78452.28
Organism:
Homo sapiens (Human)
Description:
P14780
Residue:
707
  
Inhibitor
Name:
BDBM50031795
Synonyms:
(N-(2-HYDROXAMATEMETHYLENE-4-METHYL-PENTOYL)PHENYLALANYL)METHYL AMINE (R)-N4-hydroxy-2-isobutyl-N1-((S)-1-(methylamino)-1-oxo-3-phenylpropan-2-yl)succinamide METHYLAMINO-PHENYLALANYL-LEUCYL-HYDROXAMIC ACID
Type:
Small organic molecule
Emp. Form.:
C18H27N3O4
Mol. Mass.:
349.4247
SMILES:
CNC(=O)[C@H](Cc1ccccc1)NC(=O)[C@H](CC(C)C)CC(=O)NO
: