Target
Matrix metalloproteinase-9
Ligand
BDBM50245250
Substrate
Meas. Tech.
ChEMBL_510908 (CHEMBL1007242)
IC50
>300000±n/a nM
Citation
 Campestre, CTortorella, PAgamennone, MPreziuso, SBiasone, ANuti, ERossello, AGallina, C Peptidyl 3-substituted 1-hydroxyureas as isosteric analogues of succinylhydroxamate MMP inhibitors. Eur J Med Chem 43:1008-14 (2008)  
Target
Name:
Matrix metalloproteinase-9
Synonyms:
67 kDa matrix metalloproteinase-9 92 kDa gelatinase CLG4B Gelatinase B MMP9 Matrix metalloproteinase 9 (MMP-9) Matrix metalloproteinase-9 (MMP9)
Type:
Enzyme
Mol. Mass.:
78452.28
Organism:
Homo sapiens (Human)
Description:
P14780
Residue:
707
  
Inhibitor
Name:
BDBM50245250
Synonyms:
CHEMBL445994 | L-Leucyl-L-phenylalanine methylamide
Type:
Small organic molecule
Emp. Form.:
C16H25N3O2
Mol. Mass.:
291.3886
SMILES:
CNC(=O)[C@H](Cc1ccccc1)NC(=O)[C@@H](N)CC(C)C
: