Target
Interstitial collagenase
Ligand
BDBM50272134
Substrate
Meas. Tech.
ChEMBL_510903 (CHEMBL1006447)
IC50
270000±n/a nM
Citation
 Campestre, CTortorella, PAgamennone, MPreziuso, SBiasone, ANuti, ERossello, AGallina, C Peptidyl 3-substituted 1-hydroxyureas as isosteric analogues of succinylhydroxamate MMP inhibitors. Eur J Med Chem 43:1008-14 (2008)  
Target
Name:
Interstitial collagenase
Synonyms:
CLG MMP1 Matrix metalloproteinase-1 | Matrix metalloproteinase-1 (MMP-1)
Type:
Enzyme
Mol. Mass.:
54010.26
Organism:
Homo sapiens (Human)
Description:
P03956
Residue:
469
  
Inhibitor
Name:
BDBM50272134
Synonyms:
CHEMBL501715 | N-[(Hydroxyamino)carbonyl]-L-leucyl-Lphenylalanine methylamide
Type:
Small organic molecule
Emp. Form.:
C17H26N4O4
Mol. Mass.:
350.4127
SMILES:
CNC(=O)[C@H](Cc1ccccc1)NC(=O)[C@H](CC(C)C)NC(=O)NO
: