Target
Gonadotropin-releasing hormone receptor
Ligand
BDBM50162007
Substrate
Meas. Tech.
ChEMBL_555923 (CHEMBL956659)
Ki
3.5±n/a nM
Citation
 Betz, SFZhu, YFChen, CStruthers, RS Non-peptide gonadotropin-releasing hormone receptor antagonists. J Med Chem 51:3331-48 (2008)  
Target
Name:
Gonadotropin-releasing hormone receptor
Synonyms:
GNRHR | GNRHR_MACMU
Type:
PROTEIN
Mol. Mass.:
7087.59
Organism:
Macaca mulatta
Description:
ChEMBL_495156
Residue:
59
  
Inhibitor
Name:
BDBM50162007
Synonyms:
(R)-1-(2,6-difluorobenzyl)-3-(2-amino-2-phenylethyl)-5-(2-fluoro-3-methoxyphenyl)-6-methylpyrimidine-2,4(1H,3H)-dione 3-[(2R)-amino-2-phenylethyl]-1-(2,6-difluorobenzyl)-5-(2-fluoro-3-methoxyphenyl)-6-methylpyrimidin-2,4-dione | CHEMBL179691
Type:
Small organic molecule
Emp. Form.:
C27H24F3N3O3
Mol. Mass.:
495.493
SMILES:
COc1cccc(c1F)-c1c(C)n(Cc2c(F)cccc2F)c(=O)n(C[C@H](N)c2ccccc2)c1=O
: