Target
Cyclin-dependent kinase 4
Ligand
BDBM50270732
Substrate
Meas. Tech.
ChEMBL_556875 (CHEMBL964735)
IC50
3300±n/a nM
Citation
 Tsou, HROtteng, MTran, TFloyd, MBReich, MBirnberg, GKutterer, KAyral-Kaloustian, SRavi, MNilakantan, RGrillo, MMcGinnis, JPRabindran, SK 4-(Phenylaminomethylene)isoquinoline-1,3(2H,4H)-diones as potent and selective inhibitors of the cyclin-dependent kinase 4 (CDK4). J Med Chem 51:3507-25 (2008)  
Target
Name:
Cyclin-dependent kinase 4
Synonyms:
CDK4 Cell division protein kinase 4 PSK-J3
Type:
Enzyme Subunit
Mol. Mass.:
33731.96
Organism:
Homo sapiens (Human)
Description:
P11802
Residue:
303
  
Inhibitor
Name:
BDBM50270732
Synonyms:
(4Z)-4-({[4-(Piperidin-1-ylmethyl)phenyl]amino}methylene)-isoquinoline-1,3(2H,4H)-dione | CHEMBL486284
Type:
Small organic molecule
Emp. Form.:
C22H23N3O2
Mol. Mass.:
361.4369
SMILES:
O=C1NC(=O)c2ccccc2C1=CNc1ccc(CN2CCCCC2)cc1
: