Target
Cyclin-dependent kinase 4
Ligand
BDBM50270644
Substrate
Meas. Tech.
ChEMBL_556875 (CHEMBL964735)
IC50
250±n/a nM
Citation
 Tsou, HROtteng, MTran, TFloyd, MBReich, MBirnberg, GKutterer, KAyral-Kaloustian, SRavi, MNilakantan, RGrillo, MMcGinnis, JPRabindran, SK 4-(Phenylaminomethylene)isoquinoline-1,3(2H,4H)-diones as potent and selective inhibitors of the cyclin-dependent kinase 4 (CDK4). J Med Chem 51:3507-25 (2008)  
Target
Name:
Cyclin-dependent kinase 4
Synonyms:
CDK4 Cell division protein kinase 4 PSK-J3
Type:
Enzyme Subunit
Mol. Mass.:
33731.96
Organism:
Homo sapiens (Human)
Description:
P11802
Residue:
303
  
Inhibitor
Name:
BDBM50270644
Synonyms:
(4Z)-6-(3-Furyl)-4-({[2-(4-methylpiperazin-1-yl)pyrimidin-5-yl]amino}methylene)isoquinoline-1,3(2H,4H)-dione | CHEMBL483081
Type:
Small organic molecule
Emp. Form.:
C23H22N6O3
Mol. Mass.:
430.4592
SMILES:
CN1CCN(CC1)c1ncc(NC=C2C(=O)NC(=O)c3ccc(cc23)-c2ccoc2)cn1
: