Target
Cyclin-dependent kinase 4
Ligand
BDBM50270521
Substrate
Meas. Tech.
ChEMBL_556875 (CHEMBL964735)
IC50
3000±n/a nM
Citation
 Tsou, HROtteng, MTran, TFloyd, MBReich, MBirnberg, GKutterer, KAyral-Kaloustian, SRavi, MNilakantan, RGrillo, MMcGinnis, JPRabindran, SK 4-(Phenylaminomethylene)isoquinoline-1,3(2H,4H)-diones as potent and selective inhibitors of the cyclin-dependent kinase 4 (CDK4). J Med Chem 51:3507-25 (2008)  
Target
Name:
Cyclin-dependent kinase 4
Synonyms:
CDK4 Cell division protein kinase 4 PSK-J3
Type:
Enzyme Subunit
Mol. Mass.:
33731.96
Organism:
Homo sapiens (Human)
Description:
P11802
Residue:
303
  
Inhibitor
Name:
BDBM50270521
Synonyms:
(4Z)-6-Iodo-4-[({4-[(2S,5R)-2,4,5-trimethylpiperazin-1-yl]phenyl}amino)methylene]-isoquinoline-1,3(2H,4H)-dione | CHEMBL477077
Type:
Small organic molecule
Emp. Form.:
C23H25IN4O2
Mol. Mass.:
516.3747
SMILES:
C[C@@H]1CN([C@@H](C)CN1C)c1ccc(NC=C2C(=O)NC(=O)c3ccc(I)cc23)cc1
: