Target
Beta-2 adrenergic receptor
Ligand
BDBM50252659
Substrate
Meas. Tech.
ChEMBL_487764 (CHEMBL1009496)
Ki
>10000±n/a nM
Citation
 Jin, JAn, MSapienza, AAiyar, NNaselsky, DSarau, HMFoley, JJSalyers, KLKnight, SDKeenan, RMRivero, RADhanak, DDouglas, SA Urotensin-II receptor antagonists: synthesis and SAR of N-cyclic azaalkyl benzamides. Bioorg Med Chem Lett 18:3950-4 (2008)  
Target
Name:
Beta-2 adrenergic receptor
Synonyms:
ADRB2 ADRB2_HUMAN Beta-2 adrenoceptor | Beta-2 adrenoreceptor
Type:
Mol. Mass.:
46461.69
Organism:
Homo sapiens (Human)
Description:
P07550
Residue:
413
  
Inhibitor
Name:
BDBM50252659
Synonyms:
(S)-N-(1-(3-bromo-4-(piperidin-4-yloxy)benzyl)pyrrolidin-3-yl)-3,4-dichlorobenzamide | CHEMBL495075
Type:
Small organic molecule
Emp. Form.:
C23H26BrCl2N3O2
Mol. Mass.:
527.281
SMILES:
Clc1ccc(cc1Cl)C(=O)N[C@H]1CCN(Cc2ccc(OC3CCNCC3)c(Br)c2)C1
: