Target
Urotensin-2 receptor
Ligand
BDBM50252095
Substrate
Meas. Tech.
ChEMBL_487750 (CHEMBL1009482)
Ki
47±n/a nM
Citation
 Jin, JAn, MSapienza, AAiyar, NNaselsky, DSarau, HMFoley, JJSalyers, KLKnight, SDKeenan, RMRivero, RADhanak, DDouglas, SA Urotensin-II receptor antagonists: synthesis and SAR of N-cyclic azaalkyl benzamides. Bioorg Med Chem Lett 18:3950-4 (2008)  
Target
Name:
Urotensin-2 receptor
Synonyms:
G-protein coupled receptor 14 UR-II-R UTS2R Urotensin-II
Type:
Enzyme Catalytic Domain
Mol. Mass.:
42159.71
Organism:
Homo sapiens (Human)
Description:
Urotensin-II UTS2R HUMAN::Q9UKP6
Residue:
389
  
Inhibitor
Name:
BDBM50252095
Synonyms:
(+/-)-N-(1-(3-chloro-4-(1-methylpyrrolidin-3-yloxy)benzyl)pyrrolidin-3-yl)-3,4-dichlorobenzamide | CHEMBL520258
Type:
Small organic molecule
Emp. Form.:
C23H26Cl3N3O2
Mol. Mass.:
482.83
SMILES:
CN1CCC(C1)Oc1ccc(CN2CCC(C2)NC(=O)c2ccc(Cl)c(Cl)c2)cc1Cl
: