Target
Urotensin-2 receptor
Ligand
BDBM50251890
Substrate
Meas. Tech.
ChEMBL_487750 (CHEMBL1009482)
Ki
500±n/a nM
Citation
 Jin, JAn, MSapienza, AAiyar, NNaselsky, DSarau, HMFoley, JJSalyers, KLKnight, SDKeenan, RMRivero, RADhanak, DDouglas, SA Urotensin-II receptor antagonists: synthesis and SAR of N-cyclic azaalkyl benzamides. Bioorg Med Chem Lett 18:3950-4 (2008)  
Target
Name:
Urotensin-2 receptor
Synonyms:
G-protein coupled receptor 14 UR-II-R UTS2R Urotensin-II
Type:
Enzyme Catalytic Domain
Mol. Mass.:
42159.71
Organism:
Homo sapiens (Human)
Description:
Urotensin-II UTS2R HUMAN::Q9UKP6
Residue:
389
  
Inhibitor
Name:
BDBM50251890
Synonyms:
CHEMBL481129 | N-(1-(4-(3-(dimethylamino)propoxy)benzyl)piperidin-4-yl)-3,4-dichlorobenzamide
Type:
Small organic molecule
Emp. Form.:
C24H31Cl2N3O2
Mol. Mass.:
464.428
SMILES:
CN(C)CCCOc1ccc(CN2CCC(CC2)NC(=O)c2ccc(Cl)c(Cl)c2)cc1
: