Target
Urotensin-2 receptor
Ligand
BDBM50240963
Substrate
Meas. Tech.
ChEMBL_487750 (CHEMBL1009482)
Ki
200±n/a nM
Citation
 Jin, JAn, MSapienza, AAiyar, NNaselsky, DSarau, HMFoley, JJSalyers, KLKnight, SDKeenan, RMRivero, RADhanak, DDouglas, SA Urotensin-II receptor antagonists: synthesis and SAR of N-cyclic azaalkyl benzamides. Bioorg Med Chem Lett 18:3950-4 (2008)  
Target
Name:
Urotensin-2 receptor
Synonyms:
G-protein coupled receptor 14 UR-II-R UTS2R Urotensin-II
Type:
Enzyme Catalytic Domain
Mol. Mass.:
42159.71
Organism:
Homo sapiens (Human)
Description:
Urotensin-II UTS2R HUMAN::Q9UKP6
Residue:
389
  
Inhibitor
Name:
BDBM50240963
Synonyms:
(S)-3,4-dichloro-N-(1-(4-(3-(dimethylamino)propoxy)benzyl)pyrrolidin-3-yl)benzamide 3,4-Dichloro-N-{(S)-1-[4-(3-dimethylamino-propoxy)-benzyl]-pyrrolidin-3-yl}-benzamide SB-436811
Type:
Small organic molecule
Emp. Form.:
C23H29Cl2N3O2
Mol. Mass.:
450.401
SMILES:
CN(C)CCCOc1ccc(CN2CC[C@@H](C2)NC(=O)c2ccc(Cl)c(Cl)c2)cc1
: