Target
Histamine H1 receptor
Ligand
BDBM50185474
Substrate
Meas. Tech.
ChEMBL_490811 (CHEMBL992748)
Ki
259.6±n/a nM
Citation
 Ablordeppey, SYAltundas, RBricker, BZhu, XYKumar, EVJackson, TKhan, ARoth, BL Identification of a butyrophenone analog as a potential atypical antipsychotic agent: 4-[4-(4-chlorophenyl)-1,4-diazepan-1-yl]-1-(4-fluorophenyl)butan-1-one. Bioorg Med Chem 16:7291-301 (2008)  
Target
Name:
Histamine H1 receptor
Synonyms:
H1R HISTAMINE H1 HRH1_HUMAN
Type:
G Protein-Coupled Receptor (GPCR)
Mol. Mass.:
55808.72
Organism:
Homo sapiens (Human)
Description:
Cell pellets from SK-N-MC cells transfected with human H1 receptor were used in binding assay.
Residue:
487
  
Inhibitor
Name:
BDBM50185474
Synonyms:
(+)-4-(3-(4-chlorophenyl)-3-hydroxypyrrolidin-1-yl)-1-(4-fluorophenyl)butan-1-one (-)-4-(3-(4-chlorophenyl)-3-hydroxypyrrolidin-1-yl)-1-(4-fluorophenyl)butan-1-one 4-(3-(4-chlorophenyl)-3-hydroxypyrrolidin-1-yl)-1-(4-fluorophenyl)butan-1-one 4-{3-(4-chlorophenyl)-3-hydroxypyrrolidin-1-yl}-1-(4-fluorophenyl)butan-1-one | CHEMBL150161
Type:
Small organic molecule
Emp. Form.:
C20H21ClFNO2
Mol. Mass.:
361.838
SMILES:
OC1(CCN(CCCC(=O)c2ccc(F)cc2)C1)c1ccc(Cl)cc1
: