Target
Mitogen-activated protein kinase 14
Ligand
BDBM50263261
Substrate
Meas. Tech.
ChEMBL_489078 (CHEMBL987298)
Ki
1.6±n/a nM
Citation
 Angell, RMAngell, TDBamborough, PBamford, MJChung, CWCockerill, SGFlack, SSJones, KLLaine, DILongstaff, TLudbrook, SPearson, RSmith, KJSmee, PASomers, DOWalker, AL Biphenyl amide p38 kinase inhibitors 4: DFG-in and DFG-out binding modes. Bioorg Med Chem Lett 18:4433-7 (2008)  
Target
Name:
Mitogen-activated protein kinase 14
Synonyms:
CSAID-binding protein CSBP1 CSPB1 MAP kinase 14 MAP kinase p38 alpha MAPK14 MK14_HUMAN Mitogen-activated protein kinase p38 alpha Stress-activated protein kinase 2a | p38 MAP kinase alpha/beta
Type:
Serine/threonine-protein kinase
Mol. Mass.:
41286.76
Organism:
Homo sapiens (Human)
Description:
Q16539
Residue:
360
  
Inhibitor
Name:
BDBM50263261
Synonyms:
5'-(3-Furan-3-yl-benzoylamino)-2'-methyl-biphenyl-4-carboxylic acid cyclopropylmethyl-amide | CHEMBL476996
Type:
Small organic molecule
Emp. Form.:
C29H26N2O3
Mol. Mass.:
450.5283
SMILES:
Cc1ccc(NC(=O)c2cccc(c2)-c2ccoc2)cc1-c1ccc(cc1)C(=O)NCC1CC1
: