Target
Coagulation factor X
Ligand
BDBM50273262
Substrate
Meas. Tech.
ChEMBL_510032 (CHEMBL995175)
Ki
51±n/a nM
Citation
 Uchida, MOkazaki, KMukaiyama, HIsawa, HKobayashi, HShiohara, HMuranaka, HKai, YKikuchi, NTakeuchi, HYokoyama, KTsuji, EOzawa, THoyano, YKoizumi, TMisawa, KHara, KNakano, SMurakami, YOkuno, H Orally active factor Xa inhibitors: investigation of a novel series of 3-amidinophenylsulfonamide derivatives using an amidoxime prodrug strategy. Bioorg Med Chem Lett 18:4682-7 (2008)  
Target
Name:
Coagulation factor X
Synonyms:
Activated coagulation factor X (FXa) Coagulation factor X precursor F10 Factor X heavy chain Factor Xa Stuart-Prower factor
Type:
Enzyme
Mol. Mass.:
54726.60
Organism:
Homo sapiens (Human)
Description:
Residue:
488
  
Inhibitor
Name:
BDBM50273262
Synonyms:
CHEMBL458067 | {2-[2-(5-Carbamimidoyl-2-hydroxy-benzenesulfonylamino)-ethyl]-5-isopropyl-phenoxy}-acetic acid
Type:
Small organic molecule
Emp. Form.:
C20H25N3O6S
Mol. Mass.:
435.494
SMILES:
CC(C)c1ccc(CCNS(=O)(=O)c2cc(ccc2O)C(N)=N)c(OCC(O)=O)c1
: