Target
Coagulation factor XI
Ligand
BDBM50272558
Substrate
Meas. Tech.
ChEMBL_510239 (CHEMBL1005617)
Ki
17±n/a nM
Citation
 Shiraishi, TKadono, SHaramura, MKodama, HOno, YIikura, HEsaki, TKoga, THattori, KWatanabe, YSakamoto, AYoshihashi, KKitazawa, TEsaki, KOhta, MSato, HKozono, T Factor VIIa inhibitors: target hopping in the serine protease family using X-ray structure determination. Bioorg Med Chem Lett 18:4533-7 (2008)  
Target
Name:
Coagulation factor XI
Synonyms:
Coagulation factor XIa Coagulation factor XIa light chain FA11_HUMAN Factor XIa PTA | Plasma thromboplastin antecedent
Type:
Enzyme
Mol. Mass.:
70130.58
Organism:
Homo sapiens (Human)
Description:
P03951
Residue:
625
  
Inhibitor
Name:
BDBM50272558
Synonyms:
4-({(1S,2S)-1-[(S)-1-(4-Carbamimidoyl-benzylcarbamoyl)-3-carbamoyl-propylcarbamoyl]-2-methyl-butylsulfamoyl}-methyl)-benzoic acid | CHEMBL506501
Type:
Small organic molecule
Emp. Form.:
C27H36N6O7S
Mol. Mass.:
588.676
SMILES:
CC[C@H](C)[C@H](NS(=O)(=O)Cc1ccc(cc1)C(O)=O)C(=O)N[C@@H](CCC(N)=O)C(=O)NCc1ccc(cc1)C(N)=N
: